{"text_format":"3","workbook":"xlsx","n_sheets":2,"sheets":["单一来源项目列表","单一来源明细列表"],"not_rendered":{"defined_names":1},"read":"whole","date_system":"1900"}

{"sheet":"单一来源项目列表","index":0,"n_rows":3,"n_cols":6,"rows_kept":3}
["序号","单一来源编号","申报单位","项目名称","拟定单一来源供应商名称","明细数"]
[1,"202410030001",{"$f":"VLOOKUP(B2,单一来源明细列表!A:D,2,FALSE)","v":"车辆中心"},{"$f":"VLOOKUP(B2,单一来源明细列表!A:D,3,FALSE)","v":"2024年滁宁城铁车辆中心电客车制动系统风源模块部件单一来源采购项目"},{"$f":"VLOOKUP(B2,单一来源明细列表!A:D,4,FALSE)","v":"江苏锡铁运维车辆设备有限公司"},{"$f":"COUNTIFS(单一来源明细列表!A:A,B2)","v":18}]
[2,"202410030002",{"$f":"VLOOKUP(B3,单一来源明细列表!A:D,2,FALSE)","v":"车辆中心"},{"$f":"VLOOKUP(B3,单一来源明细列表!A:D,3,FALSE)","v":"2024年滁宁城铁车辆中心除冰碳滑板单一来源采购项目"},{"$f":"VLOOKUP(B3,单一来源明细列表!A:D,4,FALSE)","v":"北京万高众业科技股份有限公司"},{"$f":"COUNTIFS(单一来源明细列表!A:A,B3)","v":1}]

{"sheet":"单一来源明细列表","index":1,"n_rows":20,"n_cols":8,"rows_kept":20}
["单一来源单据编号","申请部门","项目名称","供应商名称","标的编号","标的名称","规格型号","计量单位"]
["202410030001","车辆中心","2024年滁宁城铁车辆中心电客车制动系统风源模块部件单一来源采购项目","江苏锡铁运维车辆设备有限公司","82010000CL8001","进气过滤器滤芯","02.0082.01.1120100（NJHT 82-01-11-201）","个"]
["202410030001","车辆中心","2024年滁宁城铁车辆中心电客车制动系统风源模块部件单一来源采购项目","江苏锡铁运维车辆设备有限公司","82020000CL8002","油过滤器","02.0035.04.0001800（NJHT 35-04-00-018）","个"]
["202410030001","车辆中心","2024年滁宁城铁车辆中心电客车制动系统风源模块部件单一来源采购项目","江苏锡铁运维车辆设备有限公司","82020000CL8003","油分芯","02.0082.01.0300500（NJHT 82-01-03-005）","个"]
["202410030001","车辆中心","2024年滁宁城铁车辆中心电客车制动系统风源模块部件单一来源采购项目","江苏锡铁运维车辆设备有限公司","82020000CL8004","凝聚过滤器滤芯","02.0082.05.0001200（NJHT 82-05-00-012）","个"]
["202410030001","车辆中心","2024年滁宁城铁车辆中心电客车制动系统风源模块部件单一来源采购项目","江苏锡铁运维车辆设备有限公司","82020000CL8005","除尘过滤器滤芯","02.0028.08.0000300（NJHT 28-08-00-003）","个"]
["202410030001","车辆中心","2024年滁宁城铁车辆中心电客车制动系统风源模块部件单一来源采购项目","江苏锡铁运维车辆设备有限公司","82020000CL8006","滤尘器滤芯","01.1080.4114727.01","个"]
["202410030001","车辆中心","2024年滁宁城铁车辆中心电客车制动系统风源模块部件单一来源采购项目","江苏锡铁运维车辆设备有限公司","70010200008001","WD型密封圈 G1/2A","03.5.1.000297","个"]
["202410030001","车辆中心","2024年滁宁城铁车辆中心电客车制动系统风源模块部件单一来源采购项目","江苏锡铁运维车辆设备有限公司","70010200008002","O形圈 23.47×2.62","03.5.1.000401","个"]
["202410030001","车辆中心","2024年滁宁城铁车辆中心电客车制动系统风源模块部件单一来源采购项目","江苏锡铁运维车辆设备有限公司","70010200008003","内六角螺塞","03.2.03.038.0013","个"]
["202410030001","车辆中心","2024年滁宁城铁车辆中心电客车制动系统风源模块部件单一来源采购项目","江苏锡铁运维车辆设备有限公司","70010200008004","O形圈 135.89×5.33","03.5.1.003186","个"]
["202410030001","车辆中心","2024年滁宁城铁车辆中心电客车制动系统风源模块部件单一来源采购项目","江苏锡铁运维车辆设备有限公司","70010200008005","弹簧垫圈 12","03.1.6.0112000023","个"]
["202410030001","车辆中心","2024年滁宁城铁车辆中心电客车制动系统风源模块部件单一来源采购项目","江苏锡铁运维车辆设备有限公司","70010200008006","卡套密封圈 22","03.2.06.002.0081","个"]
["202410030001","车辆中心","2024年滁宁城铁车辆中心电客车制动系统风源模块部件单一来源采购项目","江苏锡铁运维车辆设备有限公司","70010200008007","O型圈（活接头）","03.5.1.000306","个"]
["202410030001","车辆中心","2024年滁宁城铁车辆中心电客车制动系统风源模块部件单一来源采购项目","江苏锡铁运维车辆设备有限公司","70010200008008","O形圈φ22×2","03.5.1.000023","个"]
["202410030001","车辆中心","2024年滁宁城铁车辆中心电客车制动系统风源模块部件单一来源采购项目","江苏锡铁运维车辆设备有限公司","70010200008009","O型圈φ15×1.8","03.5.1.000345","个"]
["202410030001","车辆中心","2024年滁宁城铁车辆中心电客车制动系统风源模块部件单一来源采购项目","江苏锡铁运维车辆设备有限公司","70010200008010","孔用弹性挡圈 12","03.1.9.0112000101","个"]
["202410030001","车辆中心","2024年滁宁城铁车辆中心电客车制动系统风源模块部件单一来源采购项目","江苏锡铁运维车辆设备有限公司","70010200008011","弹簧垫圈 6","03.1.6.0106000023","个"]
["202410030001","车辆中心","2024年滁宁城铁车辆中心电客车制动系统风源模块部件单一来源采购项目","江苏锡铁运维车辆设备有限公司","70010200008012","孔用C型挡圈","01.0180.1000500.70","个"]
["202410030002","车辆中心","2024年滁宁城铁车辆中心除冰碳滑板单一来源采购项目","北京万高众业科技股份有限公司",10040503008001,"碳滑板","SK1747","根"]